Reaction Details
TargetCDK-activating kinase assembly factor MAT1/Cyclin-H/Cyclin-dependent kinase 7
LigandBDBM50110183
Substrate/Competitorn/a
Meas. Tech.ChEMBL_1614445 (CHEMBL3856514)
Ki 3910±n/a nM
Citation Sonawane, YATaylor, MANapoleon, JVRana, SContreras, JINatarajan, A Cyclin Dependent Kinase 9 Inhibitors for Cancer Therapy. J Med Chem59:8667-8684 (2016) 
 
CDK-activating kinase assembly factor MAT1/Cyclin-H/Cyclin-dependent kinase 7
Name:CDK-activating kinase assembly factor MAT1/Cyclin-H/Cyclin-dependent kinase 7
Type:Protein
Mol. Mass.:n/a
Description:n/a
Components:This complex has 3 components.
Component 1
Name:Cyclin-dependent kinase 7
Synonyms:39 kDa protein kinase CAK1 CDK-activating kinase 1 (CAK) CDK7_HUMAN Cell division protein kinase 7 Cyclin-dependent kinase 7 (CDK7/cyclin H) P39 Mo15 TFIIH basal transcription factor complex kinase subunit
Type:Enzyme Subunit
Mol. Mass.:39047.01
Organism:Homo sapiens (Human)
Description:n/a
Residue:346
Component 2
Name:Cyclin-H
Synonyms:CCNH Cyclin H p34 | p37
Type:Enzyme Subunit
Mol. Mass.:37646.05
Organism:Homo sapiens (Human)
Description:n/a
Residue:323
Component 3
Name:CDK-activating kinase assembly factor MAT1
Synonyms:CAP35 Cyclin-G1-interacting protein MAT1_HUMAN Menage a trois RING finger protein MAT1 p35 | p36
Type:Enzyme
Mol. Mass.:35820.03
Organism:Homo sapiens (Human)
Description:P51948
Residue:309
BDBM50110183
NameBDBM50110183
Synonyms:Abemaciclib US10626107, Example LY2835219 US10696678, Example LY2835219 US11053238, LY2835219 US11351170, Example Abemaciclib
TypeSmall organic molecule
Emp. Form.C27H32F2N8
Mol. Mass.506.5934
SMILESCCN1CCN(Cc2ccc(Nc3ncc(F)c(n3)-c3cc(F)c4nc(C)n(C(C)C)c4c3)nc2)CC1