Reaction Details
Target5-hydroxytryptamine receptor 7
LigandBDBM50193430
Substrate/Competitorn/a
Meas. Tech.ChEMBL_1615902 (CHEMBL3857971)
Ki 4.5±n/a nM
Citation Lacivita, EPodlewska, SSperanza, LNiso, MSatala, GPerrone, RPerrone-Capano, CBojarski, AJLeopoldo, M Structural modifications of the serotonin 5-HT7 receptor agonist N-(4-cyanophenylmethyl)-4-(2-biphenyl)-1-piperazinehexanamide (LP-211) to improve in vitro microsomal stability: A case study. Eur J Med Chem120:363-79 (2016) 
 
5-hydroxytryptamine receptor 7
Name:5-hydroxytryptamine receptor 7
Type:G Protein-Coupled Receptor (GPCR)
Mol. Mass.:53573.08
Organism:Homo sapiens (Human)
Description:P34969
Residue:479
BDBM50193430
NameBDBM50193430
Synonyms:CHEMBL3985152
TypeSmall organic molecule
Emp. Form.C31H39N3O3
Mol. Mass.501.6597
SMILESCOCOc1ccc(CNC(=O)CCCCCN2CCN(CC2)c2ccccc2-c2ccccc2)cc1