Reaction Details
TargetSigma non-opioid intracellular receptor 1
LigandBDBM50193455
Substrate/Competitorn/a
Meas. Tech.ChEMBL_1615946 (CHEMBL3858015)
Ki 0.950000±n/a nM
Citation Zampieri, DVio, LFermeglia, MPricl, SWünsch, BSchepmann, DRomano, MMamolo, MGLaurini, E Computer-assisted design, synthesis, binding and cytotoxicity assessments of new 1-(4-(aryl(methyl)amino)butyl)-heterocyclic sigma 1 ligands. Eur J Med Chem121:712-726 (2016) 
 
Sigma non-opioid intracellular receptor 1
Name:Sigma non-opioid intracellular receptor 1
Type:Protein
Mol. Mass.:25307.17
Organism:Cavia porcellus (Guinea pig)
Description:Q60492
Residue:223
BDBM50193455
NameBDBM50193455
Synonyms:CHEMBL3966143
TypeSmall organic molecule
Emp. Form.C21H25ClN2O2
Mol. Mass.372.888
SMILESCN(CCCCN1C(COC1=O)c1ccccc1)Cc1ccc(Cl)cc1