Reaction Details
TargetHistone-lysine N-methyltransferase EZH2
LigandBDBM50193660
Substrate/Competitorn/a
Meas. Tech.ChEMBL_1615977 (CHEMBL3858046)
IC50 41±n/a nM
Citation Kung, PPRui, EBergqvist, SBingham, PBraganza, JCollins, MCui, MDiehl, WDinh, DFan, CFantin, VRGukasyan, HJHu, WHuang, BKephart, SKrivacic, CKumpf, RALi, GMaegley, KAMcAlpine, INguyen, LNinkovic, SOrnelas, MRyskin, MScales, SSutton, STatlock, JVerhelle, DWang, FWells, PWythes, MYamazaki, SYip, BYu, XZehnder, LZhang, WGRollins, RAEdwards, M Design and Synthesis of Pyridone-Containing 3,4-Dihydroisoquinoline-1(2H)-ones as a Novel Class of Enhancer of Zeste Homolog 2 (EZH2) Inhibitors. J Med Chem59:8306-25 (2016) 
 
Histone-lysine N-methyltransferase EZH2
Name:Histone-lysine N-methyltransferase EZH2
Type:Protein
Mol. Mass.:85367.84
Organism:Homo sapiens (Human)
Description:Q15910
Residue:746
BDBM50193660
NameBDBM50193660
Synonyms:CHEMBL3928387
TypeSmall organic molecule
Emp. Form.C20H23ClN2O3
Mol. Mass.374.861
SMILESCC(C)Oc1ccc2CCN(Cc3c(C)cc(C)[nH]c3=O)C(=O)c2c1Cl