Reaction Details
TargetHistone-lysine N-methyltransferase EZH2
LigandBDBM50193724
Substrate/Competitorn/a
Meas. Tech.ChEMBL_1615982 (CHEMBL3858051)
IC50 290±n/a nM
Citation Kung, PPRui, EBergqvist, SBingham, PBraganza, JCollins, MCui, MDiehl, WDinh, DFan, CFantin, VRGukasyan, HJHu, WHuang, BKephart, SKrivacic, CKumpf, RALi, GMaegley, KAMcAlpine, INguyen, LNinkovic, SOrnelas, MRyskin, MScales, SSutton, STatlock, JVerhelle, DWang, FWells, PWythes, MYamazaki, SYip, BYu, XZehnder, LZhang, WGRollins, RAEdwards, M Design and Synthesis of Pyridone-Containing 3,4-Dihydroisoquinoline-1(2H)-ones as a Novel Class of Enhancer of Zeste Homolog 2 (EZH2) Inhibitors. J Med Chem59:8306-25 (2016) 
 
Histone-lysine N-methyltransferase EZH2
Name:Histone-lysine N-methyltransferase EZH2
Type:Protein
Mol. Mass.:85367.84
Organism:Homo sapiens (Human)
Description:Q15910
Residue:746
BDBM50193724
NameBDBM50193724
Synonyms:CHEMBL3975589
TypeSmall organic molecule
Emp. Form.C22H25ClN2O4
Mol. Mass.416.898
SMILESCc1cc(C)c(CN2CCc3c(C)cc(O[C@@H]4CCOC4)c(Cl)c3C2=O)c(=O)[nH]1