Reaction Details
TargetKappa-type opioid receptor
LigandBDBM50194197
Substrate/Competitorn/a
Meas. Tech.ChEMBL_1616609 (CHEMBL3858678)
Ki 211±n/a nM
Citation Guerrieri, EBermudez, MWolber, GBerzetei-Gurske, IPSchmidhammer, HSpetea, M Structural determinants of diphenethylamines for interaction with theż opioid receptor: Synthesis, pharmacology and molecular modeling studies. Bioorg Med Chem Lett26:4769-4774 (2016) 
 
Kappa-type opioid receptor
Name:Kappa-type opioid receptor
Type:G Protein-Coupled Receptor (GPCR)
Mol. Mass.:42648.76
Organism:Homo sapiens (Human)
Description:P41145
Residue:380
BDBM50194197
NameBDBM50194197
Synonyms:CHEMBL3923010
TypeSmall organic molecule
Emp. Form.C24H27NO
Mol. Mass.345.4773
SMILESOc1cccc(CCN(CCc2ccccc2)CCc2ccccc2)c1