Reaction Details
TargetMu-type opioid receptor
LigandBDBM50194236
Substrate/Competitorn/a
Meas. Tech.ChEMBL_1616610 (CHEMBL3858679)
Ki 1750±n/a nM
Citation Guerrieri, EBermudez, MWolber, GBerzetei-Gurske, IPSchmidhammer, HSpetea, M Structural determinants of diphenethylamines for interaction with theż opioid receptor: Synthesis, pharmacology and molecular modeling studies. Bioorg Med Chem Lett26:4769-4774 (2016) 
 
Mu-type opioid receptor
Name:Mu-type opioid receptor
Type:G Protein-Coupled Receptor (GPCR)
Mol. Mass.:44789.51
Organism:Homo sapiens (Human)
Description:P35372
Residue:400
BDBM50194236
NameBDBM50194236
Synonyms:CHEMBL3950863
TypeSmall organic molecule
Emp. Form.C20H25NO
Mol. Mass.295.4186
SMILESOc1ccc(CCN(CCc2ccccc2)CC2CC2)cc1