Reaction Details
TargetDipeptidyl peptidase 1
LigandBDBM50195244
Substrate/Competitorn/a
Meas. Tech.ChEMBL_1617559 (CHEMBL3859628)
IC50 13±n/a nM
Citation Connolly, SLönn, HKäck, HVan de Poël, ADahl, GDoyle, KGardiner, PRoot, JWikell, CJohannesson, PStenvall, KSwallow, S Discovery of Second Generation Reversible Covalent DPP1 Inhibitors Leading to an Oxazepane Amidoacetonitrile Based Clinical Candidate (AZD7986). J Med Chem59:9457-9472 (2016) 
 
Dipeptidyl peptidase 1
Name:Dipeptidyl peptidase 1
Type:Enzyme
Mol. Mass.:51857.28
Organism:Homo sapiens (Human)
Description:P53634
Residue:463
BDBM50195244
NameBDBM50195244
Synonyms:CHEMBL3926554 US10669245, Example 24 US11655221, Example 24 US20230278969, Example 24
TypeSmall organic molecule
Emp. Form.C25H26N4O3
Mol. Mass.430.4989
SMILESCn1c2cc(ccc2ccc1=O)-c1ccc(C[C@H](NC(=O)[C@@H]2CNCCCO2)C#N)cc1