Reaction Details
TargetDipeptidyl peptidase 1
LigandBDBM50011502
Substrate/Competitorn/a
Meas. Tech.ChEMBL_1617560 (CHEMBL3859629)
IC50 7.9±n/a nM
Citation Connolly, SLönn, HKäck, HVan de Poël, ADahl, GDoyle, KGardiner, PRoot, JWikell, CJohannesson, PStenvall, KSwallow, S Discovery of Second Generation Reversible Covalent DPP1 Inhibitors Leading to an Oxazepane Amidoacetonitrile Based Clinical Candidate (AZD7986). J Med Chem59:9457-9472 (2016) 
 
Dipeptidyl peptidase 1
Name:Dipeptidyl peptidase 1
Type:Enzyme
Mol. Mass.:51857.28
Organism:Homo sapiens (Human)
Description:P53634
Residue:463
BDBM50011502
NameBDBM50011502
Synonyms:CHEMBL3261926
TypeSmall organic molecule
Emp. Form.C22H22N4O2
Mol. Mass.374.4357
SMILESNC1(CCOCC1)C(=O)N[C@@H](Cc1ccc(cc1)-c1ccc(cc1)C#N)C#N