Reaction Details
TargetAlpha-1A adrenergic receptor
LigandBDBM50195266
Substrate/Competitorn/a
Meas. Tech.ChEMBL_1617618 (CHEMBL3859687)
IC50 2057±n/a nM
Citation Guo, DLi, JLin, HZhou, YChen, YZhao, FSun, HZhang, DLi, HShoichet, BKShan, LZhang, WXie, XJiang, HLiu, H Design, Synthesis, and Biological Evaluation of Novel Tetrahydroprotoberberine Derivatives (THPBs) as Selectivea J Med Chem59:9489-9502 (2016) 
 
Alpha-1A adrenergic receptor
Name:Alpha-1A adrenergic receptor
Type:Cell-surface receptors
Mol. Mass.:51511.67
Organism:Homo sapiens (Human)
Description:P35348
Residue:466
BDBM50195266
NameBDBM50195266
Synonyms:CHEMBL3895460
TypeSmall organic molecule
Emp. Form.C20H17FN2O2
Mol. Mass.336.3596
SMILESFc1ccc2c3CC4N(CCc5cc6OCOc6cc45)Cc3[nH]c2c1