Reaction Details
TargetAlpha-1A adrenergic receptor
LigandBDBM50195276
Substrate/Competitorn/a
Meas. Tech.ChEMBL_1617618 (CHEMBL3859687)
IC50 7600±n/a nM
Citation Guo, DLi, JLin, HZhou, YChen, YZhao, FSun, HZhang, DLi, HShoichet, BKShan, LZhang, WXie, XJiang, HLiu, H Design, Synthesis, and Biological Evaluation of Novel Tetrahydroprotoberberine Derivatives (THPBs) as Selectivea J Med Chem59:9489-9502 (2016) 
 
Alpha-1A adrenergic receptor
Name:Alpha-1A adrenergic receptor
Type:Cell-surface receptors
Mol. Mass.:51511.67
Organism:Homo sapiens (Human)
Description:P35348
Residue:466
BDBM50195276
NameBDBM50195276
Synonyms:CHEMBL3984336
TypeSmall organic molecule
Emp. Form.C21H22ClNO4
Mol. Mass.387.857
SMILES[Cl-].COc1ccc2Cc3[n+](Cc2c1OC)ccc1cc(OC)c(OC)cc31