Reaction Details
TargetWD repeat-containing protein 5
LigandBDBM50195365
Substrate/Competitorn/a
Meas. Tech.ChEMBL_1617717 (CHEMBL3859786)
IC50>20±n/a nM
Citation Li, DDWang, ZHChen, WLXie, YYYou, QDGuo, XK Structure-based design of ester compounds to inhibit MLL complex catalytic activity by targeting mixed lineage leukemia 1 (MLL1)-WDR5 interaction. Bioorg Med Chem24:6109-6118 (2016) 
 
WD repeat-containing protein 5
Name:WD repeat-containing protein 5
Type:Protein
Mol. Mass.:36597.13
Organism:Homo sapiens (Human)
Description:P61964
Residue:334
BDBM50195365
NameBDBM50195365
Synonyms:CHEMBL3943757
TypeSmall organic molecule
Emp. Form.C22H27FN4O3
Mol. Mass.414.4732
SMILESCC(C)OC(=O)c1ccc(N2CCN(C)CC2)c(NC(=O)c2ccc(F)c(N)c2)c1