Reaction Details
TargetC-X-C chemokine receptor type 4
LigandBDBM50196269
Substrate/Competitorn/a
Meas. Tech.ChEMBL_1618265 (CHEMBL3860434)
EC50 58±n/a nM
Citation Mona, CEBesserer-Offroy, ÉCabana, JLefrançois, MBoulais, PELefebvre, MRLeduc, RLavigne, PHeveker, NMarsault, ÉEscher, E Structure-Activity Relationship and Signaling of New Chimeric CXCR4 Agonists. J Med Chem59:7512-24 (2016) 
 
C-X-C chemokine receptor type 4
Name:C-X-C chemokine receptor type 4
Type:Enzyme
Mol. Mass.:39754.61
Organism:Homo sapiens (Human)
Description:P61073
Residue:352
BDBM50196269
NameBDBM50196269
Synonyms:CHEMBL3976727
TypeSmall organic molecule
Emp. Form.C139H222N46O31S2
Mol. Mass.3097.67
SMILESCC(C)C[C@H](NC(=O)[C@H](CO)NC(=O)[C@@H](NC(=O)[C@@H]1CCCN1C(=O)[C@@H](N)CCCCN)C(C)C)C(=O)N[C@@H](CO)C(=O)N[C@@H](Cc1ccc(O)cc1)C(=O)N[C@@H](CCCNC(N)=N)C(=O)N[C@@H](CO)C(=O)N[C@@H](C)C(=O)NCCCC[C@H](NC(=O)[C@@H]1CSSC[C@H](NC(=O)[C@H](Cc2ccc3ccccc3c2)NC(=O)[C@H](CCCNC(N)=N)NC(=O)[C@@H](N)CCCNC(N)=N)C(=O)N[C@@H](Cc2ccc(O)cc2)C(=O)N[C@@H](CCCNC(N)=N)C(=O)N[C@@H](CCCCN)C(=O)N[C@H](CCCCN)C(=O)N2CCC[C@H]2C(=O)N[C@@H](Cc2ccc(O)cc2)C(=O)N[C@@H](CCCNC(N)=N)C(=O)N[C@@H](CCCNC(N)=N)C(=O)N1)C(O)=O