Reaction Details
TargetSodium/hydrogen exchanger 3
LigandBDBM50196805
Substrate/Competitorn/a
Meas. Tech.ChEMBL_1618862 (CHEMBL3861031)
IC50 4.0±n/a nM
Citation Rackelmann, NMatter, HEnglert, HFollmann, MMaier, TWeston, JArndt, PHeyse, WMertsch, KWirth, KBialy, L Discovery and Optimization of 1-Phenoxy-2-aminoindanes as Potent, Selective, and Orally Bioavailable Inhibitors of the Na J Med Chem59:8812-8829 (2016) 
 
Sodium/hydrogen exchanger 3
Name:Sodium/hydrogen exchanger 3
Type:PROTEIN
Mol. Mass.:92861.96
Organism:Homo sapiens (Human)
Description:ChEMBL_141050
Residue:834
BDBM50196805
NameBDBM50196805
Synonyms:CHEMBL3978001
TypeSmall organic molecule
Emp. Form.C23H28Cl2N2O4S
Mol. Mass.499.45
SMILESCS(=O)(=O)c1ccc(O[C@@H]2[C@H](Cc3c2cc(Cl)cc3Cl)N2CCC[C@H](C2)NCCO)cc1