Reaction Details
TargetLeukotriene A-4 hydrolase
LigandBDBM50116538
Substrate/Competitorn/a
Meas. Tech.ChEMBL_1619185 (CHEMBL3861354)
Ki 3.0±n/a nM
Citation Wittmann, SKKalinowsky, LKramer, JSBloecher, RKnapp, SSteinhilber, DPogoryelov, DProschak, EHeering, J Thermodynamic properties of leukotriene A Bioorg Med Chem24:5243-5248 (2016) 
 
Leukotriene A-4 hydrolase
Name:Leukotriene A-4 hydrolase
Type:Hydrolase; metalloprotease
Mol. Mass.:69280.41
Organism:Homo sapiens (Human)
Description:Human recombinant LTA4H.
Residue:611
BDBM50116538
NameBDBM50116538
Synonyms:3-{[3-(4-Benzyl-phenoxy)-propyl]-methyl-amino}-propionic acid; hydrochloride CHEMBL543405 | SC-57461A
TypeSmall organic molecule
Emp. Form.C20H25NO3
Mol. Mass.327.4174
SMILESCN(CCCOc1ccc(Cc2ccccc2)cc1)CCC(O)=O