Reaction Details
TargetFatty acid-binding protein, heart
LigandBDBM50197089
Substrate/Competitorn/a
Meas. Tech.ChEMBL_1619188 (CHEMBL3861357)
Ki 9700±n/a nM
Citation Kühne, HObst-Sander, UKuhn, BConte, ACeccarelli, SMNeidhart, WRudolph, MGOttaviani, GGasser, RSo, SSLi, SZhang, XGao, LMyers, M Design and synthesis of selective, dual fatty acid binding protein 4 and 5 inhibitors. Bioorg Med Chem Lett26:5092-5097 (2016) 
 
Fatty acid-binding protein, heart
Name:Fatty acid-binding protein, heart
Type:PROTEIN
Mol. Mass.:14858.36
Organism:Homo sapiens (Human)
Description:ChEMBL_1463784
Residue:133
BDBM50197089
NameBDBM50197089
Synonyms:CHEMBL3889982
TypeSmall organic molecule
Emp. Form.C22H19ClN4O2
Mol. Mass.406.865
SMILESClc1ccc2nc(N3CCCCC3)c(-c3n[nH]c(=O)o3)c(-c3ccccc3)c2c1