Reaction Details
TargetFatty acid-binding protein, heart
LigandBDBM50197091
Substrate/Competitorn/a
Meas. Tech.ChEMBL_1619188 (CHEMBL3861357)
Ki 93±n/a nM
Citation Kühne, HObst-Sander, UKuhn, BConte, ACeccarelli, SMNeidhart, WRudolph, MGOttaviani, GGasser, RSo, SSLi, SZhang, XGao, LMyers, M Design and synthesis of selective, dual fatty acid binding protein 4 and 5 inhibitors. Bioorg Med Chem Lett26:5092-5097 (2016) 
 
Fatty acid-binding protein, heart
Name:Fatty acid-binding protein, heart
Type:PROTEIN
Mol. Mass.:14858.36
Organism:Homo sapiens (Human)
Description:ChEMBL_1463784
Residue:133
BDBM50197091
NameBDBM50197091
Synonyms:CHEMBL1738980
TypeSmall organic molecule
Emp. Form.C17H12ClNO2
Mol. Mass.297.736
SMILESCc1nc2ccc(Cl)cc2c(-c2ccccc2)c1C(O)=O