Reaction Details
TargetFatty acid-binding protein, heart
LigandBDBM50197086
Substrate/Competitorn/a
Meas. Tech.ChEMBL_1619188 (CHEMBL3861357)
Ki 400±n/a nM
Citation Kühne, HObst-Sander, UKuhn, BConte, ACeccarelli, SMNeidhart, WRudolph, MGOttaviani, GGasser, RSo, SSLi, SZhang, XGao, LMyers, M Design and synthesis of selective, dual fatty acid binding protein 4 and 5 inhibitors. Bioorg Med Chem Lett26:5092-5097 (2016) 
 
Fatty acid-binding protein, heart
Name:Fatty acid-binding protein, heart
Type:PROTEIN
Mol. Mass.:14858.36
Organism:Homo sapiens (Human)
Description:ChEMBL_1463784
Residue:133
BDBM50197086
NameBDBM50197086
Synonyms:CHEMBL3971182
TypeSmall organic molecule
Emp. Form.C21H18Cl2N2O2
Mol. Mass.401.286
SMILESOC(=O)c1c(nc2c(Cl)cc(Cl)cc2c1-c1ccccc1)N1CCCCC1