Reaction Details
TargetProstaglandin E synthase
LigandBDBM50029593
Substrate/Competitorn/a
Meas. Tech.ChEMBL_1619471 (CHEMBL3861640)
IC50 7.0±n/a nM
Citation Park, EBKim, KJJeong, HRLee, JKKim, HJLee, HHLim, JWShin, JSKoeberle, AWerz, OLee, KTLee, JY Synthesis, structure determination, and biological evaluation of phenylsulfonyl hydrazide derivatives as potential anti-inflammatory agents. Bioorg Med Chem Lett26:5193-5197 (2016) 
 
Prostaglandin E synthase
Name:Prostaglandin E synthase
Type:PROTEIN
Mol. Mass.:17293.88
Organism:Mus musculus
Description:ChEMBL_104562
Residue:153
BDBM50029593
NameBDBM50029593
Synonyms:CHEMBL7162 N-(2-Cyclohexyloxy-4-nitro-phenyl)-methanesulfonamide N-[2-(cyclohexyloxy)-4-nitrophenyl]methane sulfonamide N-{2-(cyclohexyloxy)-4-[hydroxy(oxido)amino]phenyl}methanesulfonamide NS398
TypeSmall organic molecule
Emp. Form.C13H18N2O5S
Mol. Mass.314.357
SMILESCS(=O)(=O)Nc1ccc(cc1OC1CCCCC1)[N+]([O-])=O