Reaction Details
TargetCarboxypeptidase B2
LigandBDBM50197529
Substrate/Competitorn/a
Meas. Tech.ChEBML_1619507
IC50>30000±n/a nM
Citation Halland, NCzech, JCzechtizky, WEvers, AFollmann, MKohlmann, MSchreuder, HAKallus, C Sulfamide as Zinc Binding Motif in Small Molecule Inhibitors of Activated Thrombin Activatable Fibrinolysis Inhibitor (TAFIa). J Med Chem59:9567-9573 (2016) 
 
Carboxypeptidase B2
Name:Carboxypeptidase B2
Type:Enzyme
Mol. Mass.:48432.74
Organism:Homo sapiens (Human)
Description:Q96IY4
Residue:423
BDBM50197529
NameBDBM50197529
Synonyms:CHEMBL3944308
TypeSmall organic molecule
Emp. Form.C28H50N4O5S
Mol. Mass.554.785
SMILESCC1(C)[C@@H]2CC[C@@]1(C)[C@H](C2)NC(=O)[C@H](CC1CCCCC1)NS(=O)(=O)N[C@@H](CC1CCC(N)CC1)C(O)=O