Reaction Details
TargetCarboxypeptidase B2
LigandBDBM50197531
Substrate/Competitorn/a
Meas. Tech.ChEBML_1619507
IC50 1100±n/a nM
Citation Halland, NCzech, JCzechtizky, WEvers, AFollmann, MKohlmann, MSchreuder, HAKallus, C Sulfamide as Zinc Binding Motif in Small Molecule Inhibitors of Activated Thrombin Activatable Fibrinolysis Inhibitor (TAFIa). J Med Chem59:9567-9573 (2016) 
 
Carboxypeptidase B2
Name:Carboxypeptidase B2
Type:Enzyme
Mol. Mass.:48432.74
Organism:Homo sapiens (Human)
Description:Q96IY4
Residue:423
BDBM50197531
NameBDBM50197531
Synonyms:CHEMBL3949183
TypeSmall organic molecule
Emp. Form.C27H48N4O5S
Mol. Mass.540.759
SMILESCC12CC3CC(C)(C1)CC(C3)(C2)NC(=O)[C@H](CC1CCCCC1)NS(=O)(=O)N[C@@H](CCCCN)C(O)=O