Reaction Details
TargetCarboxypeptidase B2
LigandBDBM50197536
Substrate/Competitorn/a
Meas. Tech.ChEBML_1619507
IC50 220±n/a nM
Citation Halland, NCzech, JCzechtizky, WEvers, AFollmann, MKohlmann, MSchreuder, HAKallus, C Sulfamide as Zinc Binding Motif in Small Molecule Inhibitors of Activated Thrombin Activatable Fibrinolysis Inhibitor (TAFIa). J Med Chem59:9567-9573 (2016) 
 
Carboxypeptidase B2
Name:Carboxypeptidase B2
Type:Enzyme
Mol. Mass.:48432.74
Organism:Homo sapiens (Human)
Description:Q96IY4
Residue:423
BDBM50197536
NameBDBM50197536
Synonyms:CHEMBL3982584
TypeSmall organic molecule
Emp. Form.C26H48N4O5S
Mol. Mass.528.748
SMILESCC1(C)[C@@H]2CC[C@@]1(C)[C@H](C2)NC(=O)[C@H](CCC1CCCCC1)NS(=O)(=O)N[C@@H](CCCCN)C(O)=O