Reaction Details
TargetCarboxypeptidase B2
LigandBDBM50197543
Substrate/Competitorn/a
Meas. Tech.ChEBML_1619507
IC50 200±n/a nM
Citation Halland, NCzech, JCzechtizky, WEvers, AFollmann, MKohlmann, MSchreuder, HAKallus, C Sulfamide as Zinc Binding Motif in Small Molecule Inhibitors of Activated Thrombin Activatable Fibrinolysis Inhibitor (TAFIa). J Med Chem59:9567-9573 (2016) 
 
Carboxypeptidase B2
Name:Carboxypeptidase B2
Type:Enzyme
Mol. Mass.:48432.74
Organism:Homo sapiens (Human)
Description:Q96IY4
Residue:423
BDBM50197543
NameBDBM50197543
Synonyms:CHEMBL3955010
TypeSmall organic molecule
Emp. Form.C27H42N4O5S
Mol. Mass.534.711
SMILESCC1(C)[C@@H]2CC[C@@]1(C)[C@H](C2)NC(=O)[C@H](CC1CCCCC1)NS(=O)(=O)N[C@@H](Cc1cccnc1)C(O)=O