Reaction Details
TargetCarboxypeptidase B2
LigandBDBM50197580
Substrate/Competitorn/a
Meas. Tech.ChEMBL_1619504 (CHEMBL3861673)
IC50 12±n/a nM
Citation Halland, NCzech, JCzechtizky, WEvers, AFollmann, MKohlmann, MSchreuder, HAKallus, C Sulfamide as Zinc Binding Motif in Small Molecule Inhibitors of Activated Thrombin Activatable Fibrinolysis Inhibitor (TAFIa). J Med Chem59:9567-9573 (2016) 
 
Carboxypeptidase B2
Name:Carboxypeptidase B2
Type:Enzyme
Mol. Mass.:48432.74
Organism:Homo sapiens (Human)
Description:Q96IY4
Residue:423
BDBM50197580
NameBDBM50197580
Synonyms:CHEMBL3933831
TypeSmall organic molecule
Emp. Form.C25H46N4O5S
Mol. Mass.514.722
SMILESCC1(C)[C@@H]2CC[C@@]1(C)[C@H](C2)NC(=O)[C@H](CC1CCCCC1)NS(=O)(=O)N[C@@H](CCCCN)C(O)=O