Reaction Details
TargetCarboxypeptidase B2
LigandBDBM50197553
Substrate/Competitorn/a
Meas. Tech.ChEMBL_1619504 (CHEMBL3861673)
IC50 6400±n/a nM
Citation Halland, NCzech, JCzechtizky, WEvers, AFollmann, MKohlmann, MSchreuder, HAKallus, C Sulfamide as Zinc Binding Motif in Small Molecule Inhibitors of Activated Thrombin Activatable Fibrinolysis Inhibitor (TAFIa). J Med Chem59:9567-9573 (2016) 
 
Carboxypeptidase B2
Name:Carboxypeptidase B2
Type:Enzyme
Mol. Mass.:48432.74
Organism:Homo sapiens (Human)
Description:Q96IY4
Residue:423
BDBM50197553
NameBDBM50197553
Synonyms:CHEMBL3981469
TypeSmall organic molecule
Emp. Form.C25H45N3O6S
Mol. Mass.515.706
SMILESCC1(C)C2CCC1(C)C(C2)OC(=O)[C@H](CC1CCCCC1)NS(=O)(=O)N[C@@H](CCCCN)C(O)=O