Reaction Details
TargetCarboxypeptidase B2
LigandBDBM50197573
Substrate/Competitorn/a
Meas. Tech.ChEMBL_1619504 (CHEMBL3861673)
IC50 3±n/a nM
Citation Halland, NCzech, JCzechtizky, WEvers, AFollmann, MKohlmann, MSchreuder, HAKallus, C Sulfamide as Zinc Binding Motif in Small Molecule Inhibitors of Activated Thrombin Activatable Fibrinolysis Inhibitor (TAFIa). J Med Chem59:9567-9573 (2016) 
 
Carboxypeptidase B2
Name:Carboxypeptidase B2
Type:Enzyme
Mol. Mass.:48432.74
Organism:Homo sapiens (Human)
Description:Q96IY4
Residue:423
BDBM50197573
NameBDBM50197573
Synonyms:CHEMBL3912764
TypeSmall organic molecule
Emp. Form.C26H46N4O4
Mol. Mass.478.6678
SMILESCC1(C)C2CCC1(C)[C@H](C2)NC(=O)[C@H](CC1CCCCC1)NC(=O)N[C@@H](CCCCN)C(O)=O