Reaction Details
TargetCarboxypeptidase B2
LigandBDBM50197570
Substrate/Competitorn/a
Meas. Tech.ChEMBL_1619504 (CHEMBL3861673)
IC50 420±n/a nM
Citation Halland, NCzech, JCzechtizky, WEvers, AFollmann, MKohlmann, MSchreuder, HAKallus, C Sulfamide as Zinc Binding Motif in Small Molecule Inhibitors of Activated Thrombin Activatable Fibrinolysis Inhibitor (TAFIa). J Med Chem59:9567-9573 (2016) 
 
Carboxypeptidase B2
Name:Carboxypeptidase B2
Type:Enzyme
Mol. Mass.:48432.74
Organism:Homo sapiens (Human)
Description:Q96IY4
Residue:423
BDBM50197570
NameBDBM50197570
Synonyms:CHEMBL3939311
TypeSmall organic molecule
Emp. Form.C22H40N4O5S
Mol. Mass.472.642
SMILESNCCCC[C@H](NS(=O)(=O)N[C@@H](CC1CCCCC1)C(=O)N[C@H]1C[C@H]2CC[C@H]1C2)C(O)=O