Reaction Details
TargetAmine oxidase [flavin-containing] A
LigandBDBM50197875
Substrate/Competitorn/a
Meas. Tech.ChEMBL_1620024 (CHEMBL3862307)
IC50 20800±n/a nM
Citation Wu, MYEsteban, GBrogi, SShionoya, MWang, LCampiani, GUnzeta, MInokuchi, TButini, SMarco-Contelles, J Donepezil-like multifunctional agents: Design, synthesis, molecular modeling and biological evaluation. Eur J Med Chem121:864-879 (2016) 
 
Amine oxidase [flavin-containing] A
Name:Amine oxidase [flavin-containing] A
Type:Protein
Mol. Mass.:59689.53
Organism:Homo sapiens (Human)
Description:P21397
Residue:527
BDBM50197875
NameBDBM50197875
Synonyms:CHEMBL3910142
TypeSmall organic molecule
Emp. Form.C29H32N4O
Mol. Mass.452.5906
SMILESOc1cccc2ccc(CN(CC#C)C(CCC3CCN(Cc4ccccc4)CC3)C#N)nc12