Reaction Details
TargetAmine oxidase [flavin-containing] A
LigandBDBM50197878
Substrate/Competitorn/a
Meas. Tech.ChEMBL_1620016 (CHEMBL3862299)
IC50 37000±n/a nM
Citation Wu, MYEsteban, GBrogi, SShionoya, MWang, LCampiani, GUnzeta, MInokuchi, TButini, SMarco-Contelles, J Donepezil-like multifunctional agents: Design, synthesis, molecular modeling and biological evaluation. Eur J Med Chem121:864-879 (2016) 
 
Amine oxidase [flavin-containing] A
Name:Amine oxidase [flavin-containing] A
Type:Protein
Mol. Mass.:59689.53
Organism:Homo sapiens (Human)
Description:P21397
Residue:527
BDBM50197878
NameBDBM50197878
Synonyms:CHEMBL3961103
TypeSmall organic molecule
Emp. Form.C28H33N3O
Mol. Mass.427.5811
SMILESOc1cccc2ccc(CN(CCCC3CCN(Cc4ccccc4)CC3)CC#C)nc12