Reaction Details
TargetAmine oxidase [flavin-containing] B
LigandBDBM50197880
Substrate/Competitorn/a
Meas. Tech.ChEMBL_1620017 (CHEMBL3862300)
IC50>100000±n/a nM
Citation Wu, MYEsteban, GBrogi, SShionoya, MWang, LCampiani, GUnzeta, MInokuchi, TButini, SMarco-Contelles, J Donepezil-like multifunctional agents: Design, synthesis, molecular modeling and biological evaluation. Eur J Med Chem121:864-879 (2016) 
 
Amine oxidase [flavin-containing] B
Name:Amine oxidase [flavin-containing] B
Type:Protein
Mol. Mass.:58768.76
Organism:Homo sapiens (Human)
Description:P27338
Residue:520
BDBM50197880
NameBDBM50197880
Synonyms:CHEMBL3931599
TypeSmall organic molecule
Emp. Form.C26H29N3O
Mol. Mass.399.528
SMILESOc1cccc2ccc(CN(CC#C)CC3CCN(Cc4ccccc4)CC3)nc12