Reaction Details
TargetAmine oxidase [flavin-containing] B
LigandBDBM50197875
Substrate/Competitorn/a
Meas. Tech.ChEMBL_1620017 (CHEMBL3862300)
IC50>100000±n/a nM
Citation Wu, MYEsteban, GBrogi, SShionoya, MWang, LCampiani, GUnzeta, MInokuchi, TButini, SMarco-Contelles, J Donepezil-like multifunctional agents: Design, synthesis, molecular modeling and biological evaluation. Eur J Med Chem121:864-879 (2016) 
 
Amine oxidase [flavin-containing] B
Name:Amine oxidase [flavin-containing] B
Type:Protein
Mol. Mass.:58768.76
Organism:Homo sapiens (Human)
Description:P27338
Residue:520
BDBM50197875
NameBDBM50197875
Synonyms:CHEMBL3910142
TypeSmall organic molecule
Emp. Form.C29H32N4O
Mol. Mass.452.5906
SMILESOc1cccc2ccc(CN(CC#C)C(CCC3CCN(Cc4ccccc4)CC3)C#N)nc12