Reaction Details
TargetAcetylcholinesterase
LigandBDBM50197877
Substrate/Competitorn/a
Meas. Tech.ChEMBL_1620019 (CHEMBL3862302)
IC50 4100±n/a nM
Citation Wu, MYEsteban, GBrogi, SShionoya, MWang, LCampiani, GUnzeta, MInokuchi, TButini, SMarco-Contelles, J Donepezil-like multifunctional agents: Design, synthesis, molecular modeling and biological evaluation. Eur J Med Chem121:864-879 (2016) 
 
Acetylcholinesterase
Name:Acetylcholinesterase
Type:Enzyme
Mol. Mass.:67792.70
Organism:Homo sapiens (Human)
Description:P22303
Residue:614
BDBM50197877
NameBDBM50197877
Synonyms:CHEMBL3892118
TypeSmall organic molecule
Emp. Form.C27H31N3O
Mol. Mass.413.5545
SMILESOc1cccc2ccc(CN(CCC3CCN(Cc4ccccc4)CC3)CC#C)nc12