Reaction Details
TargetCholinesterase
LigandBDBM50197880
Substrate/Competitorn/a
Meas. Tech.ChEMBL_1620015 (CHEMBL3862298)
IC50 64±n/a nM
Citation Wu, MYEsteban, GBrogi, SShionoya, MWang, LCampiani, GUnzeta, MInokuchi, TButini, SMarco-Contelles, J Donepezil-like multifunctional agents: Design, synthesis, molecular modeling and biological evaluation. Eur J Med Chem121:864-879 (2016) 
 
Cholinesterase
Name:Cholinesterase
Type:Homotetramer
Mol. Mass.:68422.27
Organism:Homo sapiens (Human)
Description:P06276
Residue:602
BDBM50197880
NameBDBM50197880
Synonyms:CHEMBL3931599
TypeSmall organic molecule
Emp. Form.C26H29N3O
Mol. Mass.399.528
SMILESOc1cccc2ccc(CN(CC#C)CC3CCN(Cc4ccccc4)CC3)nc12