Reaction Details
TargetCholinesterase
LigandBDBM50197878
Substrate/Competitorn/a
Meas. Tech.ChEMBL_1620015 (CHEMBL3862298)
IC50 23±n/a nM
Citation Wu, MYEsteban, GBrogi, SShionoya, MWang, LCampiani, GUnzeta, MInokuchi, TButini, SMarco-Contelles, J Donepezil-like multifunctional agents: Design, synthesis, molecular modeling and biological evaluation. Eur J Med Chem121:864-879 (2016) 
 
Cholinesterase
Name:Cholinesterase
Type:Homotetramer
Mol. Mass.:68422.27
Organism:Homo sapiens (Human)
Description:P06276
Residue:602
BDBM50197878
NameBDBM50197878
Synonyms:CHEMBL3961103
TypeSmall organic molecule
Emp. Form.C28H33N3O
Mol. Mass.427.5811
SMILESOc1cccc2ccc(CN(CCCC3CCN(Cc4ccccc4)CC3)CC#C)nc12