Reaction Details
TargetAmine oxidase [flavin-containing] A
LigandBDBM50197876
Substrate/Competitorn/a
Meas. Tech.ChEMBL_1620016 (CHEMBL3862299)
IC50 10200±n/a nM
Citation Wu, MYEsteban, GBrogi, SShionoya, MWang, LCampiani, GUnzeta, MInokuchi, TButini, SMarco-Contelles, J Donepezil-like multifunctional agents: Design, synthesis, molecular modeling and biological evaluation. Eur J Med Chem121:864-879 (2016) 
 
Amine oxidase [flavin-containing] A
Name:Amine oxidase [flavin-containing] A
Type:Protein
Mol. Mass.:59689.53
Organism:Homo sapiens (Human)
Description:P21397
Residue:527
BDBM50197876
NameBDBM50197876
Synonyms:CHEMBL3901082
TypeSmall organic molecule
Emp. Form.C27H28N4O
Mol. Mass.424.5374
SMILESOc1cccc2ccc(CN(CC#C)C(C#N)C3CCN(Cc4ccccc4)CC3)nc12