Reaction Details
TargetAmine oxidase [flavin-containing] B
LigandBDBM50197878
Substrate/Competitorn/a
Meas. Tech.ChEMBL_1620017 (CHEMBL3862300)
IC50>100000±n/a nM
Citation Wu, MYEsteban, GBrogi, SShionoya, MWang, LCampiani, GUnzeta, MInokuchi, TButini, SMarco-Contelles, J Donepezil-like multifunctional agents: Design, synthesis, molecular modeling and biological evaluation. Eur J Med Chem121:864-879 (2016) 
 
Amine oxidase [flavin-containing] B
Name:Amine oxidase [flavin-containing] B
Type:Protein
Mol. Mass.:58768.76
Organism:Homo sapiens (Human)
Description:P27338
Residue:520
BDBM50197878
NameBDBM50197878
Synonyms:CHEMBL3961103
TypeSmall organic molecule
Emp. Form.C28H33N3O
Mol. Mass.427.5811
SMILESOc1cccc2ccc(CN(CCCC3CCN(Cc4ccccc4)CC3)CC#C)nc12