Reaction Details
TargetHeat sensitive channel TRPV3
LigandBDBM50197967
Substrate/Competitorn/a
Meas. Tech.ChEMBL_1620335 (CHEMBL3862618)
IC50 94400±n/a nM
Citation Pollastro, FGolin, SChianese, GPutra, MYSchiano Moriello, ADe Petrocellis, LGarcía, VMunoz, ETaglialatela-Scafati, OAppendino, G Neuroactive and Anti-inflammatory Frankincense Cembranes: A Structure-Activity Study. J Nat Prod79:1762-8 (2016) 
 
Heat sensitive channel TRPV3
Name:Heat sensitive channel TRPV3
Synonyms:Heat sensitive channel TRPV3
Type:PROTEIN
Mol. Mass.:90273.53
Organism:Rattus norvegicus
Description:ChEMBL_116972
Residue:791
BDBM50197967
NameBDBM50197967
Synonyms:CHEMBL3948101
TypeSmall organic molecule
Emp. Form.C29H40O3
Mol. Mass.436.6261
SMILESCC(C)[C@@]12CC[C@@](C)(O1)[C@H](CC\C(C)=C\CC\C(C)=C\C2)OC(=O)\C=C\c1ccccc1