Reaction Details
TargetHeat sensitive channel TRPV3
LigandBDBM50197968
Substrate/Competitorn/a
Meas. Tech.ChEMBL_1620335 (CHEMBL3862618)
IC50>100000±n/a nM
Citation Pollastro, FGolin, SChianese, GPutra, MYSchiano Moriello, ADe Petrocellis, LGarcía, VMunoz, ETaglialatela-Scafati, OAppendino, G Neuroactive and Anti-inflammatory Frankincense Cembranes: A Structure-Activity Study. J Nat Prod79:1762-8 (2016) 
 
Heat sensitive channel TRPV3
Name:Heat sensitive channel TRPV3
Synonyms:Heat sensitive channel TRPV3
Type:PROTEIN
Mol. Mass.:90273.53
Organism:Rattus norvegicus
Description:ChEMBL_116972
Residue:791
BDBM50197968
NameBDBM50197968
Synonyms:CHEMBL3904515
TypeSmall organic molecule
Emp. Form.C20H34O3
Mol. Mass.322.4822
SMILES[H][C@@]12C[C@@]3(CC[C@@](C)(O3)[C@@H](O)CC\C(C)=C\CC[C@]1(C)O2)C(C)C