Reaction Details
TargetHeat sensitive channel TRPV3
LigandBDBM50197971
Substrate/Competitorn/a
Meas. Tech.ChEMBL_1620334 (CHEMBL3862617)
EC50 1200±n/a nM
Citation Pollastro, FGolin, SChianese, GPutra, MYSchiano Moriello, ADe Petrocellis, LGarcía, VMunoz, ETaglialatela-Scafati, OAppendino, G Neuroactive and Anti-inflammatory Frankincense Cembranes: A Structure-Activity Study. J Nat Prod79:1762-8 (2016) 
 
Heat sensitive channel TRPV3
Name:Heat sensitive channel TRPV3
Synonyms:Heat sensitive channel TRPV3
Type:PROTEIN
Mol. Mass.:90273.53
Organism:Rattus norvegicus
Description:ChEMBL_116972
Residue:791
BDBM50197971
NameBDBM50197971
Synonyms:CHEMBL3890789
TypeSmall organic molecule
Emp. Form.C28H40O3
Mol. Mass.424.6154
SMILESCC(C)[C@@]12CC[C@@](C)(O1)[C@H](CC\C(C)=C\CC\C(C)=C\C2)OC(=O)Cc1ccccc1