Reaction Details
TargetHeat sensitive channel TRPV3
LigandBDBM50197963
Substrate/Competitorn/a
Meas. Tech.ChEMBL_1620335 (CHEMBL3862618)
IC50 5800±n/a nM
Citation Pollastro, FGolin, SChianese, GPutra, MYSchiano Moriello, ADe Petrocellis, LGarcía, VMunoz, ETaglialatela-Scafati, OAppendino, G Neuroactive and Anti-inflammatory Frankincense Cembranes: A Structure-Activity Study. J Nat Prod79:1762-8 (2016) 
 
Heat sensitive channel TRPV3
Name:Heat sensitive channel TRPV3
Synonyms:Heat sensitive channel TRPV3
Type:PROTEIN
Mol. Mass.:90273.53
Organism:Rattus norvegicus
Description:ChEMBL_116972
Residue:791
BDBM50197963
NameBDBM50197963
Synonyms:CHEMBL3983336
TypeSmall organic molecule
Emp. Form.C20H32O2
Mol. Mass.304.4669
SMILESCC(C)[C@@]12CC[C@@](C)(O1)C(=O)CC\C(C)=C\CC\C(C)=C\C2