Reaction Details
TargetHistamine H3 receptor
LigandBDBM50198913
Substrate/Competitorn/a
Meas. Tech.ChEMBL_1621015 (CHEMBL3863298)
Ki 17±n/a nM
Citation Labeeuw, OLevoin, NBillot, XDanvy, DCalmels, TKrief, SLigneau, XBerrebi-Bertrand, IRobert, PLecomte, JMSchwartz, JCCapet, M Synthesis and evaluation of a 2-benzothiazolylphenylmethyl ether class of histamine H4 receptor antagonists. Bioorg Med Chem Lett26:5263-5266 (2016) 
 
Histamine H3 receptor
Name:Histamine H3 receptor
Type:G Protein-Coupled Receptor (GPCR)
Mol. Mass.:48691.47
Organism:Homo sapiens (Human)
Description:Binding assays were using CHO cells stably expressing hH3R receptors.
Residue:445
BDBM50198913
NameBDBM50198913
Synonyms:CHEMBL1179089
TypeSmall organic molecule
Emp. Form.C19H20N2O
Mol. Mass.292.3749
SMILESC(COC(c1ccccc1)c1ccccc1)Cc1c[nH]cn1