Reaction Details
TargetPhosphatidylinositol 4-kinase beta
LigandBDBM50200098
Substrate/Competitorn/a
Meas. Tech.ChEMBL_1621783 (CHEMBL3864066)
IC50 2.4±n/a nM
Citation Mejdrová, IChalupská, DPlacková, PMüller, C?ála, MKlíma, MBaumlová, AHrebabecký, HProcházková, EDejmek, MStrunin, DWeber, JLee, GMatou?ová, MMertlíková-Kaiserová, HZiebuhr, JBirkus, GBoura, ENencka, R Rational Design of Novel Highly Potent and Selective Phosphatidylinositol 4-Kinase IIIß (PI4KB) Inhibitors as Broad-Spectrum Antiviral Agents and Tools for Chemical Biology. J Med Chem60:100-118 (2017) 
 
Phosphatidylinositol 4-kinase beta
Name:Phosphatidylinositol 4-kinase beta
Type:Protein
Mol. Mass.:91373.30
Organism:Homo sapiens (Human)
Description:n/a
Residue:816
BDBM50200098
NameBDBM50200098
Synonyms:CHEMBL3930509
TypeSmall organic molecule
Emp. Form.C20H25ClN6O4S
Mol. Mass.480.968
SMILESCOc1ccc(cc1S(=O)(=O)N(C)C)-c1c(C)nc2c(NCCNC(C)=O)cc(Cl)nn12