Reaction Details
TargetPhosphatidylinositol 4-kinase beta
LigandBDBM50200100
Substrate/Competitorn/a
Meas. Tech.ChEMBL_1621783 (CHEMBL3864066)
IC50 34±n/a nM
Citation Mejdrová, IChalupská, DPlacková, PMüller, C?ála, MKlíma, MBaumlová, AHrebabecký, HProcházková, EDejmek, MStrunin, DWeber, JLee, GMatou?ová, MMertlíková-Kaiserová, HZiebuhr, JBirkus, GBoura, ENencka, R Rational Design of Novel Highly Potent and Selective Phosphatidylinositol 4-Kinase IIIß (PI4KB) Inhibitors as Broad-Spectrum Antiviral Agents and Tools for Chemical Biology. J Med Chem60:100-118 (2017) 
 
Phosphatidylinositol 4-kinase beta
Name:Phosphatidylinositol 4-kinase beta
Type:Protein
Mol. Mass.:91373.30
Organism:Homo sapiens (Human)
Description:n/a
Residue:816
BDBM50200100
NameBDBM50200100
Synonyms:CHEMBL3905730
TypeSmall organic molecule
Emp. Form.C22H24Cl2N6O2S
Mol. Mass.507.436
SMILESCl.CN(C)S(=O)(=O)c1cccc(c1)-c1c(C)nc2c(NCc3ccnc(C)c3)cc(Cl)nn12