Reaction Details
TargetPhosphatidylinositol 4-kinase beta
LigandBDBM50200103
Substrate/Competitorn/a
Meas. Tech.ChEMBL_1621783 (CHEMBL3864066)
IC50 19±n/a nM
Citation Mejdrová, IChalupská, DPlacková, PMüller, C?ála, MKlíma, MBaumlová, AHrebabecký, HProcházková, EDejmek, MStrunin, DWeber, JLee, GMatou?ová, MMertlíková-Kaiserová, HZiebuhr, JBirkus, GBoura, ENencka, R Rational Design of Novel Highly Potent and Selective Phosphatidylinositol 4-Kinase IIIß (PI4KB) Inhibitors as Broad-Spectrum Antiviral Agents and Tools for Chemical Biology. J Med Chem60:100-118 (2017) 
 
Phosphatidylinositol 4-kinase beta
Name:Phosphatidylinositol 4-kinase beta
Type:Protein
Mol. Mass.:91373.30
Organism:Homo sapiens (Human)
Description:n/a
Residue:816
BDBM50200103
NameBDBM50200103
Synonyms:CHEMBL3948449
TypeSmall organic molecule
Emp. Form.C25H24ClN7O3S
Mol. Mass.538.021
SMILESCCc1cc(CNc2cc(Cl)nn3c(c(C)nc23)-c2ccc(OC)c(c2)S(=O)(=O)n2cccn2)ccn1