Reaction Details
TargetTyrosine-protein kinase ABL1
LigandBDBM50200534
Substrate/Competitorn/a
Meas. Tech.ChEMBL_1622558 (CHEMBL3864910)
IC50>1000±n/a nM
Citation Han, MWang, CJi, YSong, ZXing, LSu, YWang, XZhang, AAi, JGeng, M Metabolism-based structure optimization: Discovery of a potent and orally available tyrosine kinase ALK inhibitor bearing the tetracyclic benzo[b]carbazolone core. Bioorg Med Chem Lett26:5399-5402 (2016) 
 
Tyrosine-protein kinase ABL1
Name:Tyrosine-protein kinase ABL1
Type:Enzyme
Mol. Mass.:122897.30
Organism:Homo sapiens (Human)
Description:P00519
Residue:1130
BDBM50200534
NameBDBM50200534
Synonyms:CHEMBL3958173
TypeSmall organic molecule
Emp. Form.C31H36N4O3
Mol. Mass.512.6425
SMILESCCc1cc2C(=O)c3c([nH]c4cc(ccc34)C#N)C(C)(C)c2cc1N1CCN(CC2(O)CCOCC2)CC1