Reaction Details
TargetALK tyrosine kinase receptor
LigandBDBM50200538
Substrate/Competitorn/a
Meas. Tech.ChEMBL_1622537 (CHEMBL3864889)
IC50 17±n/a nM
Citation Han, MWang, CJi, YSong, ZXing, LSu, YWang, XZhang, AAi, JGeng, M Metabolism-based structure optimization: Discovery of a potent and orally available tyrosine kinase ALK inhibitor bearing the tetracyclic benzo[b]carbazolone core. Bioorg Med Chem Lett26:5399-5402 (2016) 
 
ALK tyrosine kinase receptor
Name:ALK tyrosine kinase receptor
Type:Protein
Mol. Mass.:176453.10
Organism:Homo sapiens (Human)
Description:Q9UM73
Residue:1620
BDBM50200538
NameBDBM50200538
Synonyms:CHEMBL3934754
TypeSmall organic molecule
Emp. Form.C32H36N4O6
Mol. Mass.572.6514
SMILESCCc1cc2C(=O)c3c([nH]c4cc(ccc34)C#N)C(C)(C)c2cc1N1CCN(CC(O)(CCC(O)=O)CC(O)=O)CC1