Reaction Details
TargetPotassium voltage-gated channel subfamily H member 2
LigandBDBM50362781
Substrate/Competitorn/a
Meas. Tech.ChEMBL_1622549 (CHEMBL3864901)
IC50>30000±n/a nM
Citation Han, MWang, CJi, YSong, ZXing, LSu, YWang, XZhang, AAi, JGeng, M Metabolism-based structure optimization: Discovery of a potent and orally available tyrosine kinase ALK inhibitor bearing the tetracyclic benzo[b]carbazolone core. Bioorg Med Chem Lett26:5399-5402 (2016) 
 
Potassium voltage-gated channel subfamily H member 2
Name:Potassium voltage-gated channel subfamily H member 2
Type:Multi-pass membrane protein
Mol. Mass.:126672.65
Organism:Homo sapiens (Human)
Description:Q12809
Residue:1159
BDBM50362781
NameBDBM50362781
Synonyms:1256580-46-7 Alecensa CH5424802 US10851092, Example Alectinib US9126931, 366
TypeSmall organic molecule
Emp. Form.C30H34N4O2
Mol. Mass.482.6166
SMILESCCc1cc2C(=O)c3c([nH]c4cc(ccc34)C#N)C(C)(C)c2cc1N1CCC(CC1)N1CCOCC1