Reaction Details
TargetPotassium voltage-gated channel subfamily H member 2
LigandBDBM50148632
Substrate/Competitorn/a
Meas. Tech.ChEMBL_1622708 (CHEMBL3865060)
EC50 18800±n/a nM
Citation Huang, WHulverson, MAZhang, ZChoi, RHart, KJKennedy, MVidadala, RSRMaly, DJVan Voorhis, WCLindner, SEFan, EOjo, KK 5-Aminopyrazole-4-carboxamide analogues are selective inhibitors of Plasmodium falciparum microgametocyte exflagellation and potential malaria transmission blocking agents. Bioorg Med Chem Lett26:5487-5491 (2016) 
 
Potassium voltage-gated channel subfamily H member 2
Name:Potassium voltage-gated channel subfamily H member 2
Type:Multi-pass membrane protein
Mol. Mass.:126672.65
Organism:Homo sapiens (Human)
Description:Q12809
Residue:1159
BDBM50148632
NameBDBM50148632
Synonyms:CHEMBL3770409 US9956214, Compound 1572
TypeSmall organic molecule
Emp. Form.C18H21N5O2
Mol. Mass.339.3916
SMILESCCOc1ccc2cc(cnc2c1)-c1nn(C(C)C)c(N)c1C(N)=O