Reaction Details
TargetProto-oncogene tyrosine-protein kinase Src
LigandBDBM50148632
Substrate/Competitorn/a
Meas. Tech.ChEMBL_1622697 (CHEMBL3865049)
IC50>10000±n/a nM
Citation Huang, WHulverson, MAZhang, ZChoi, RHart, KJKennedy, MVidadala, RSRMaly, DJVan Voorhis, WCLindner, SEFan, EOjo, KK 5-Aminopyrazole-4-carboxamide analogues are selective inhibitors of Plasmodium falciparum microgametocyte exflagellation and potential malaria transmission blocking agents. Bioorg Med Chem Lett26:5487-5491 (2016) 
 
Proto-oncogene tyrosine-protein kinase Src
Name:Proto-oncogene tyrosine-protein kinase Src
Type:Protein
Mol. Mass.:59838.60
Organism:Homo sapiens (Human)
Description:P12931
Residue:536
BDBM50148632
NameBDBM50148632
Synonyms:CHEMBL3770409 US9956214, Compound 1572
TypeSmall organic molecule
Emp. Form.C18H21N5O2
Mol. Mass.339.3916
SMILESCCOc1ccc2cc(cnc2c1)-c1nn(C(C)C)c(N)c1C(N)=O