Reaction Details
TargetTyrosine-protein kinase receptor TYRO3
LigandBDBM50201152
Substrate/Competitorn/a
Meas. Tech.ChEMBL_1622922 (CHEMBL3865274)
IC50 57±n/a nM
Citation Wang, XLiu, JZhang, WStashko, MANichols, JMiley, MJNorris-Drouin, JChen, ZMachius, MDeRyckere, DWood, EGraham, DKEarp, HSKireev, DFrye, SV Design and Synthesis of Novel Macrocyclic Mer Tyrosine Kinase Inhibitors. ACS Med Chem Lett7:1044-1049 (2016) 
 
Tyrosine-protein kinase receptor TYRO3
Name:Tyrosine-protein kinase receptor TYRO3
Type:Protein
Mol. Mass.:96894.13
Organism:Homo sapiens (Human)
Description:Q06418
Residue:890
BDBM50201152
NameBDBM50201152
Synonyms:CHEMBL3938180
TypeSmall organic molecule
Emp. Form.C29H42N6O
Mol. Mass.490.6834
SMILESCN1CCN(Cc2ccc(cc2)-c2cn3CCCCCC(O)CCCCCNc4ncc2c3n4)CC1